{"text_format":"1","workbook":"xlsx","n_sheets":3,"sheets":["1. Allg Info","Daten","Tabelle2"],"not_rendered":{"charts":0,"images":1,"macros":1,"external_links":0,"defined_names":26,"comments":0,"pivot_tables":0},"unopened":[],"bounds":{"document_bytes":16777216,"sheet_cells":100000,"rows_first":2000,"rows_last":500,"rows_between":2000,"halvings":0,"cell_chars":16384,"cell_head_chars":4096},"cells_cut":0,"cells_raw":0,"read":"whole","date_system":"1900"}

{"sheet":"1. Allg Info","index":0,"n_rows":151,"n_cols":20,"rows_kept":151,"cut":false,"hidden":false,"merged":[[94,6,94,8],[90,12,90,13],[93,6,93,8],[95,12,95,13],[93,9,93,11],[84,4,84,5],[85,4,85,5],[91,12,91,13],[92,12,92,13],[93,12,93,13],[90,6,90,8],[91,6,91,8],[92,6,92,8],[44,5,44,13],[60,5,60,11],[34,11,34,13],[26,5,26,13],[32,5,32,7],[34,5,34,7],[32,11,32,13],[36,5,36,13],[30,5,30,7],[30,11,30,13],[40,5,40,7],[40,11,40,13],[42,5,42,7],[42,11,42,13],[12,5,12,9],[28,5,28,7],[28,11,28,13],[38,5,38,13],[14,5,14,9],[18,5,18,9],[24,5,24,13],[2,3,2,11],[10,5,10,9],[4,5,4,13],[8,5,8,9],[6,5,6,9],[10,11,10,13],[64,9,64,13],[104,5,104,13],[48,11,48,13],[46,5,46,7],[46,11,46,13],[101,5,101,13],[98,5,98,13],[84,9,84,11],[86,9,86,11],[87,9,87,11],[88,9,88,11],[89,9,89,11],[90,9,90,11],[91,9,91,11],[92,9,92,11],[94,4,94,5],[80,7,80,9],[80,11,80,13],[126,5,126,7],[126,9,126,13],[84,6,84,8],[85,6,85,8],[122,7,122,13],[89,12,89,13],[85,9,85,11],[85,12,85,13],[86,12,86,13],[87,12,87,13],[88,12,88,13],[94,12,94,13],[94,9,94,11],[95,9,95,11],[150,5,150,7],[146,9,146,11],[148,9,148,11],[150,9,150,11],[86,6,86,8],[87,6,87,8],[88,6,88,8],[86,4,86,5],[87,4,87,5],[88,4,88,5],[89,4,89,5],[90,4,90,5],[91,4,91,5],[92,4,92,5],[93,4,93,5],[89,6,89,8],[146,5,146,7],[148,5,148,7],[140,5,140,11],[127,5,127,7],[127,9,127,13],[130,5,130,13],[138,9,138,11],[134,5,134,13],[138,5,138,7]]}
[null,null,null,null,null,null,null,null,null,null,null,null,null,null,null,null,null,null,null,"subfasub"]
[null,null,null,"Allgemeine Informationen zum Ausschreibungsverfahren",null,null,null,null,null,null,null,null,null,null,null,null,null,null,null,{"$f":"Daten!B24","v":""}]
[null,null,null,"Das Dokument ist durch die Bedarfsstellen / Vergabestellen zur Anmeldung einer Submission auszufüllen und zwei Wochen vor dem gewünschten Publikationstermin der kantonalen Fachstelle für öffentliche Beschaffungen elektronisch zukommen zu lassen. Kurzfristig eingereichte Anmeldungen können unter Umständen nicht im gewünschten Zeitrahmen bearbeitet werden. Die Angaben bilden die Grundlage für die Betreuung des Ausschreibungsverfahrens durch die kantonalen Fachstelle für öffentliche Beschaffungen."]
[]
[null,null,null,"Projektname:"]
[]
[null,null,null,"Auftrag:"]
[]
[null,null,null,"Auftragsart:"]
[]
[null,null,null,"Verfahrensart:"]
[]
[null,null,null,"Rechtsgrundlage:"]
[]
[null,null,null,"Ausschreibungsbereich:"]
[]
[null,null,null,"Wettbewerb?"]
[]
[null,null,null,"Zusatz:"]
[]
[null,null,null,"Nachwuchsförderung? "]
[]
[null,null,null,"Kontakte"]
[]
[null,null,null,"Bedarfsstelle:"]
[]
[null,null,null,"Strasse:"]
[]
[null,null,null,"Nr. ",null,null,null,null,null,"Zusatz:"]
[]
[null,null,null,"PLZ:",null,null,null,null,null,"Ort:"]
[]
[null,null,null,"Projektleiter/in:",null,null,null,null,null,"Telefon:"]
[]
[null,null,null,"Bereich:",null,null,null,null,null,"E-Mail PL:"]
[]
[null,null,null,"Externe/r Spezialist/in:"]
[]
[null,null,null,"Strasse:"]
[]
[null,null,null,"Nr. ",null,null,null,null,null,"Zusatz:"]
[]
[null,null,null,"PLZ:",null,null,null,null,null,"Ort:"]
[]
[null,null,null,"Land:"]
[]
[null,null,null,"Kontaktperson:",null,null,null,null,null,"Telefon:"]
[]
[null,null,null,null,null,null,null,null,null,"E-Mail:"]
[]
[null,null,null,"Termine"]
[]
[null,null,null,{"$f":"IF(Daten!B24=1,\"Versand der Unterlagen:\",\"Publikation der Ausschreibung:\")","v":"Publikation der Ausschreibung:"}]
[]
[null,null,null,"Unterlagen bei KFöB:",null,null,null,"Zeit KFöB:"]
[]
[null,null,null,"Begehungspflicht?"]
[]
[null,null,null,"Datum Begehung:",null,null,null,"Zeit Begehung:"]
[]
[null,null,null,"Treffpunkt:",null,null,null,null,null,null,null,null,null,null,null,null,null,null,null,""]
[]
[null,null,null,"Fragenrunde?"]
[]
[null,null,null,"Frist für Einreichen Fragen:",null,null,null,"Email an:"]
[]
[null,null,null,"Antworten auf Fragen bis:"]
[]
[null,null,null,"Datum Offerteingabe 1:",null,null,null,"Zeit Offerteingabe 1:"]
[]
[null,null,null,"Datum Offerteingabe 2:",null,null,null,"Zeit Offerteingabe 2:"]
[]
[null,null,null,"Voraussichtlicher Vergabetermin:",null,null,null,{"$f":"IFERROR(VLOOKUP(Daten!B67,EGT,8,0),\"\")","v":""}]
[]
[null,null,null,"Auftragsbeginn:",null,null,null,{"$f":"IFERROR(VLOOKUP(Daten!B67,EGT,9,0),\"\")","v":""}]
[]
[null,null,null,"Auftragsende:"]
[]
[null,null,null,"Projektinformationen"]
[]
[null,null,null,"Gesamtkreditsumme:",null,null,null,"Kosten ausgeschriebene Leistungen:"]
[]
[null,null,null,"Kosten ausgeschriebene Leistungen:",null,null,null,"exkl. MWST"]
[]
[null,null,null,"Teilprojekte / Teilsysteme","Projektleiter",null,"Budgetposition",null,null,"Kreditsumme (inkl. MWST)",null,null,null,"Kosten ausgeschriebene Leistungen (exkl. MWST)"]
[]
[]
[]
[]
[]
[]
[]
[]
[]
[]
[null,null,null,null,null,null,null,"Gesamtkosten:",null,{"$f":"SUM(J86:L95)","v":0},null,null,{"$f":"SUM(M86:N95)","v":0}]
[]
[null,null,null,"Bemerkungen/Beschlüsse:"]
[]
[]
[null,null,null,"Ort der Ausführung:"]
[]
[]
[null,null,null,"Auftragsbeschrieb:"]
[]
[]
[null,null,null,"Verfahrensinformationen"]
[]
[null,null,null,"Bietergemeinschaften zugelassen? "]
[]
[null,null,null,"Subunternehmen zugelassen? "]
[]
[null,null,null,"Varianten zum Hauptangebot zugelassen?"]
[]
[null,null,null,"Teilangebote zugelassen?"]
[]
[null,null,null,"Gültigkeit Angebot:",null,90]
[]
[null,null,null,"Ausschreibung mit mehreren Losen? "]
[]
[null,null,null,"Lose:",null,"Losnummer",null,"Beschreibung"]
[]
[]
[]
[null,null,null,"Eingeladene Firmen:",null,"Name",null,null,null,"Adresse"]
[]
[]
[]
[null,null,null,"Teilnahmebedingungen:"]
[]
[]
[]
[null,null,null,{"$f":"IF(Daten!D24=0,\"Selektionskriterien:\",\"Eignungsnachweise:\")","v":"Eignungsnachweise:"}]
[]
[]
[]
[null,null,null,"Zuschlagskriterien:",null,"Kriterien",null,null,null,null,null,null,null,"Gewichtung"]
[]
[]
[]
[null,null,null,"Beschrieb:"]
[]
[null,null,null,"Übertragung"]
[]
[null,null,null,null,null,"Übertragungsdaten",null,null,null,"Datum"]
[]
[null,null,null,"interne Projektleitung:"]
[]
[null,null,null,"externe/-r Spezialist/-in:"]
[]
[null,null,null,"via Antragsformular an KFöB:"]

{"sheet":"Daten","index":1,"n_rows":190,"n_cols":11,"rows_kept":190,"cut":false,"hidden":true,"merged":[]}
[]
[]
["Auftragsart (AFA)"]
[]
["Lieferung"]
["Dienstleistung"]
["Bauhauptgewerbe"]
["Baunebengewerbe"]
[]
[]
[]
["Zusatzspezifikation (ZUS)","Ausschreibungsbereich","Rechtsgrundlage"]
[]
["Anonymer Wettbewerb 1 Stufe","Staatsvertragsbereich","Begründung "]
["Anonymer Wettbewerb 2 Stufen","Binnenmarktbereich","gesetzliche Sondervergabe"]
["Nicht anonymer Wettbewerb 1 Stufe"]
["Nicht anonymer Wettbewerb 2 Stufen"]
["Studienauftrag"]
["Tiefbauamt"]
[]
[]
[]
[]
["Firma einladen (JA=1;NEIN=0)",{"$f":"IF('1. Allg Info'!F11<>0,VLOOKUP('1. Allg Info'!F11,VAT,2,0),\"\")","v":""},"Eignungsnachweise  (JA=1;NEIN=0)",{"$f":"IF('1. Allg Info'!F11<>0,VLOOKUP('1. Allg Info'!F11,VAT,4,0),\"\")","v":""}]
["Verfahrensart (VA)"]
[null,"Angefragte Firmen","Bietergemeinschaften","Eignungsnachweise"]
["Freihändig",1,0,1]
["Einladung",1,0,1]
["Offenes Verfahren",0,null,1]
["Selektives Verfahren",0,null,0]
[null,null,null,1]
[]
["Nachwuchsförderung ","Publikationstag",{"$f":"TEXT('1. Allg Info'!F53,\"TTT\")","v":"Sa"}]
["ja"]
["nein"]
[]
["Bedarfsstelle (BS)","Ort ","Ländercode (LC)"]
[null,null,null,null,null,null,null,null,null,null," "]
["Bau- und Verkehrsdepartement ","Basel ","Schweiz (CH)"]
["Justiz- und Sicherheitsdepartement","Bettingen ","Belgien (BE)"]
["Gesundheitsdepartement","Riehen","Dänemark (DK)"]
["Finanzdepartement","Allschwil","Deutschland (DE)"]
["Erziehungsdepartement","Binningen ","Finnland (FI)"]
["Präsidialdepartement","Birsfelden ","Frankreich (FR)"]
["Departement für Wirtschaft Soziales und Umwelt","Bottmingen ","Island (IS)"]
["Gemeinde Riehen ","Münchenstein","Italien (IT)"]
["IWB ","Muttenz","Liechtenstein (LI)"]
["Basler Verkehrsbetriebe","Reinach ","Luxemburg (LU)"]
["Pro Rheno",null,"Österreich (AT)"]
[null,null,"Schweden (SE)"]
[null,null,"Spanien (ES)"]
[]
[]
["Aufteilung in Lose (LO)"]
["Ja"]
["Nein"]
[]
[]
[]
[]
[]
[]
[]
[]
[]
[]
[null,{"$f":"'1. Allg Info'!F11&\" \"&'1. Allg Info'!F15","v":" "}]
[null,null,null,null,null,null,null,{"$f":"\"\"","v":""},{"$f":"\"\"","v":""}]
[null,null,null,null,null,null,null,{"$f":"\"\"","v":""},{"$f":"\"\"","v":""}]
["Teilnahmebedingungen (TNB)",null,null,null,null,null,null,{"$f":"\"\"","v":""},{"$f":"\"\"","v":""}]
[null,null,null,null,null,null,null,{"$f":"\"\"","v":""},{"$f":"\"\"","v":""}]
["Aktuelle Preisliste der vorgesehenen Deponie Typ B"]
["Anwendung des Unternehmererfahrungswertsystems"]
["Beilage eines Ausbildungskonzeptes des Unternehmens"]
["Beilage Organigramm"]
["Bescheinigung über berufliche Befähigung (Lebenslauf, Anforderungsprofil oder Stellenausschreibung) des für den Auftraggeber eingesetzten Personals"]
["Bestätigung der Ausgleichskasse"]
["Bestätigung der Krankentaggeldversicherung (KTV)"]
["Bestätigung der Pensionskasse"]
["Bestätigung der Steuerbehörden"]
["Bestätigung der SUVA bzw. BU/NBU"]
["Bewilligung Verkehrswachen Kapo Basel-Stadt"]
["Detaillierter Betreibungsregisterauszug"]
["Einhaltung Datenschutz- und Datensicherheitsbestimmungen"]
["Einhaltung der geltenden Arbeitsschutzbedingungen"]
["Einhaltung der Lohngleichheit von Frauen und Männern"]
["Einhaltung der veranschlagten Garantiedauer"]
["Einhaltung der veranschlagten Liefertermine und Modalitäten"]
["Einhaltung Terminprogramm"]
["Einhaltung von geforderten Sicherheitsstandards"]
["Einhaltung von Hygiene- und Ökologiestandards"]
["Einverständniserklärung der beiliegenden Vertrags- und Geschäftsbedingungen"]
["Einverständniserklärung Nachhaltigkeit"]
["Erreichbarkeit des Anbieters"]
["ESTI"]
["Geheimhaltungserklärung"]
["Nachweis der Einhaltung von §§ 5 und 6 Beschaffungsgesetz"]
["PAK-Zertifikat"]
["Qualitätssicherungssystem"]
["Reaktionszeit vor Ort"]
["Sicherheit bei Tiefbauarbeiten im Bereich von IWB Werkleitungen"]
["sonstige Teilnahmebedingung"]
["Sprachkenntnisse Schlüsselpersonen"]
["Systemintegration Energiedienstleistungs-Portal (EDL-Portal)"]
["Vorhandene Haftpflichtversicherung"]
["Vorhandene Serviceorganisation"]
["Wirtschaftliche Anforderungen"]
[]
[]
["Eignungskriterium Standard (EGS)"]
[]
["Referenzauftrag Anbieter: Nachweis eines bereits ausgeführten vergleichbaren Referenzauftrages des Anbieters, welcher die folgenden Kriterien erfüllt:\nAusführungszeitraum: In den letzten fünf Jahren ausgeführt\nLeistungsumfang: Auftragswert zirka oder mindestens CHF [zirka 1/3 des ausgeschriebenen Leistungsumfanges] exkl. MWST oder höher\nLeistungsart: Ausführung von [Leistungsart beschreiben], [Leistungsart weitere beschreiben], [Weitere Kriterien]\nReferenzen von Subunternehmen sind nicht zugelassen. [LÖSCHEN FALLS UNZUTREFFEND] \noder \nNachweis von xxx bereits ausgeführten vergleichbaren Referenzaufträgen des Anbieters, welche jeweils die folgenden Kriterien erfüllen:\nAusführungszeitraum:  In den letzten fünf Jahren ausgeführt\nLeistungsumfang:  Auftragswert zirka oder mindestens CHF [zirka 1/3 des ausgeschriebenen Leistungsumfanges] exkl. MWST oder höher\nLeistungsart: Ausführung von [Leistungsart beschreiben], [Leistungsart weitere beschreiben], [Weitere Kriterien]\nReferenzen von Subunternehmen sind nicht zugelassen. [LÖSCHEN FALLS UNZUTREFFEND] "]
["Referenzauftrag Schlüsselperson: Nachweis eines bereits ausgeführten vergleichbaren Referenzauftrages, an welchem die für die Ausführung des Auftrages vorgesehene Schlüsselperson [Schlüsselperson bezeichnen] in derselben Funktion beteiligt war. Der Referenzauftrag muss die folgenden Kriterien erfüllen:\nAusführungszeitraum: In den letzten fünf Jahren ausgeführt\nLeistungsumfang: Auftragswert zirka oder mindestens CHF [zirka 1/3 des ausgeschriebenen Leistungsumfanges] exkl. MWST oder höher \nLeistungsart: Ausführung von [Leistungsart beschreiben], [Leistungsart weitere beschreiben]\n[Weitere Kriterien]\noder \nNachweis von xxx bereits ausgeführten vergleichbaren Referenzaufträgen, an welchen die für die Ausführung des Auftrages vorgesehene Schlüsselperson [Schlüsselperson bezeichnen] in derselben Funktion beteiligt war. Die Referenzaufträge müssen die folgenden Kriterien erfüllen:\nAusführungszeitraum: In den letzten fünf Jahren ausgeführt\nLeistungsumfang:  Auftragswert zirka oder mindestens CHF [zirka 1/3 des ausgeschriebenen Leistungsumfanges] exkl. MWST oder höher \nLeistungsart:   Ausführung von [Leistungsart beschreiben], [Leistungsart weitere beschreiben]\n[Weitere Kriterien]"]
["keine"]
[]
[]
["Kriterien (KRI)"]
[]
["Preis"]
["Referenzauftrag Anbieter"]
["Referenzauftrag Schlüsselperson"]
["Auftragsanalyse"]
["Kann-Kriterien"]
["Nachhaltigkeit"]
["Qualifikation Schlüsselperson"]
["Funktionelle und technische Spezifikation"]
["Unternehmererfahrungswert"]
["Zugang zur Aufgabe"]
["sonstiges Zuschlagskriterium",null,"Unterkriterien (UKRI)"]
[]
["Beschrieb Kriterien (BKRI)",null,"Baupolier"]
[null,null,"Bauführer"]
["Die Bewertung des Preises erfolgt gemäss dem folgenden Preisbewertungsmodell: \r\n- Maximalnote für das tiefste gültige Angebot\r\n- Note 0 bei [Wert einfügen zwischen 150% und 175%] des tiefsten gültigen Angebots und für alle höheren Angebote. [für normale, gängige, einfache Beschaffungsgegenstände (geringe Gefahren und wenig Chancen)]\r\n[oder]\r\n- Note 0 bei [Wert einfügen zwischen 175% und 200%] des tiefsten gültigen Angebots und für alle höheren Angebote. [für komplexe Beschaffungsgegenstände (grosse Gefahren und viele Chancen)]\r\nAlle dazwischenliegenden Angebote werden linear bewertet.",null,"Gruppenleiter"]
["Vorlage eines bereits ausgeführten vergleichbaren Referenzauftrages des Anbieters. Der Referenzauftrag soll bezüglich folgender Kriterien möglichst mit dem ausgeschriebenen Auftrag vergleichbar sein:\n\rAusführungszeitraum: [In den letzten fünf Jahren ausgeführt]\r\nLeistungsumfang: Auftragswert vergleichbar mit dem ausgeschriebenen Auftrag.\r\nLeistungsart: \n• [Leistungsart bezeichnen]\n\r• [Leistungsart weitere bezeichnen]\n[Weitere Kriterien]\noder\nQualitative Bewertung des vom Anbieter im Eignungsnachweis: \"\"Referenzauftrag Anbieter\"\" eingereichten Referenzauftrages.\n\rDer Referenzauftrag wird hinsichtlich der folgenden Kriterien bewertet:\r\n• [Vergleichbarkeit der Aufgabe]\n\r• [Vergleichbarkeit des Auftragsvolumens]\r\n• [Funktionale/technische Qualität/Innovationsgrad]\n\r• [Angemessenheit der Lösung]\r\n• [Weitere Kriterien]",null,"Equipenführer"]
["Vorlage eines bereits ausgeführten vergleichbaren Referenzauftrages, an welchem die für die Ausführung des Auftrages vorgesehene Schlüsselperson ([Schlüsselperson bezeichnen]) in derselben Funktion beteiligt war. Der Referenzauftrag soll bezüglich folgender Kriterien möglichst mit dem ausgeschriebenen Auftrag vergleichbar sein: \nAusführungszeitraum: [In den letzten fünf Jahren ausgeführt]\r\nLeistungsumfang: Auftragswert vergleichbar mit dem ausgeschriebenen Auftrag.\nLeistungsart: \n• [Leistungsart bezeichnen]\n• [Leistungsart weitere bezeichnen]\n[Weitere Kriterien]\nDer Referenzauftrag wird hinsichtlich der folgenden Kriterien bewertet:\r\n• [Vergleichbarkeit der Aufgabe]\n• [Vergleichbarkeit des Auftragvolumens]\r\n• [Funktionale/technische Qualität/Innovationsgrad]\n• [Angemessenheit der Lösung]\n• [Weitere Kriterien]\r\nDie Schlüsselperson wird hinsichtlich der folgenden Kriterien bewertet:\r\n• [Führung von internen und externen Projektbeteiligten]\n• [Fachkompetenz]\n• [Steuerung und Einhaltung der Kosten]\r\n• [Steuerung und Einhaltung der Termine]\r\n• [Verhalten bei Abweichung zu den Projektzielen]\r\n• [Unterstützung Auftraggeber]\n• [Beiträge für Kostensenkungen, Verbesserungen/Innovationen]\n• [Verhalten im Konfliktfall]\n• [Weitere Kriterien]",null,"Projektleiter"]
["Qualitative Bewertung der vom Anbieter eingereichten Auftragsanalyse. In der Auftragsanalyse ist zu folgenden Punkten eine Aussage zu machen:\r\n• [Terminplan: Es ist aufzuzeigen, wie die im Terminplan vorgesehenen Meilensteine erreicht werden. Der Terminplan ist in Einzelgewerke und in Planungsleistungen zu unterteilen.]\n\r• [Organigramm: Es ist ein Organigramm abzugeben, auf welchem die an der Ausführung und Ausführungsplanung vorgesehenen beteiligten Firmen und Personen aufgeführt sind.]\r\n• [Risikoanalyse: Es ist eine Risikoanalyse abzugeben, in welcher folgende Punkte dargestellt sind:\na) Aufführung der erkannten Risiken, bewertet nach Eintrittswahrscheinlichkeit und Tragweite im Eintrittsfall\nb) Erläuterung der vorgesehenen Massnahmen, um diese Risiken zu vermeiden bzw. zu minimieren]\nUmfang max. [Anzahl Seiten] DIN A4-Seiten\r\nDie Auftragsanalyse wird hinsichtlich der folgenden Kriterien bewertet:\n\r• [Vollständigkeit]\r\n• [Nachvollziehbarkeit]\r\n• [Weitere Kriterien]",null,"Projektingenieur"]
["Quatlitative Bewertung der technischen Spezifikationen gemäss Dokument XXX.\nSofern nichts anderes vermerkt ist, führt eine Bessererfüllung der Spezifikationen zu einer besseren Bewertung.",null,"Bauleiter"]
["Qualitative Bewertung der Kann-Kriterien gemäss Dokument XXX.\nSofern nichts anderes vermerkt ist, führt eine Bessererfüllung der Kriterien zu einer besseren Bewertung.",null,"Chefbauleiter"]
["Qualitative Bewertung des vom Anbieter eingereichten Konzeptes in Bezug auf  ökologische Nachhaltigkeit ([z.B. Transportkonzept, Baustellen- und Entsorgungskonzept, Verpackungs- und Recyclingkonzept, Ausführungskonzept inkl. Angaben zum erforderlichen Ressourceneinsatz]), welches folgende Aspekte beinhaltet: \r\n• [ökologisches Leitbild des Unternehmens]\r\n• [Angaben zu Nachliefergarantien und Folgekosten]\r\n• [weitere Aspekte bezeichnen]\nUmfang max. [Anzahl Seiten] DIN A4-Seiten\nDas Konzept wird hinsichtlich der folgenden Kriterien bewertet:\r\n• [Vollständigkeit]\r\n• [Nachvollziehbarkeit]\r\n• [Weitere Kriterien]",null,"Sachbearbeiter"]
["Qualitative Bewertung der Schlüsselperson ([Schlüsselperson bezeichnen]). Es sind die nachfolgend aufgeführten Unterlagen für die Beurteilung der Schlüsselperson einzureichen:\r\n• [z.B. Lebenslauf]\r\n• [Weitere Unterlagen]\r\nDie Schlüsselperson wird hinsichtlich der folgenden Kriterien bewertet:\n\r• [z.B: Ausbildungsstandard, Berufserfahrung]\r\n• [Weitere Kriterien]"]
["Anhand von Skizzen, Text und / oder Bildern können Überlegungen zur Gestaltung, Nutzung, Konstruktion, Materialität und Farbigkeit, etc. dargestellt werden. \r\nDie Konzeptskizzen werden nach folgenden Kriterien bewertet:\r\n- Gestalterische und konstruktive Umsetzung der Aufgabe\r\n- Farbkonzeption und Materialisierung\r\n- Nutzungsszenarien\r\n- Einbindung in den Kontext\r\nDas Beurteilungsgremium wird aufgrund dieser Kriterien eine Gesamtbeurteilung vornehmen.\r\nund \r\nDie Konzeptskizzen und der Konzeptbeschrieb werden anonym bewertet. Dazu müssen die A3-Blätter ohne Namensnennungen mit einem Kennwort versehen in einer separaten, unbeschrifteten Mappe abgegeben werden. In dieser Mappe ist ein verschlossenes Kuvert mit Kennwort versehen einzulegen, das ein Blatt mit dem Verfassernamen enthält. Die Kuverts werden nach Einreichung von den übrigen Unterlagen getrennt, um eine anonyme Beurteilung zu gewährleisten. Die Öffnung der Verfasserkuverts erfolgt nach der Bewertung aller Zuschlagskriterien."]
["Beschreiben Sie das \"Sonstige\" Zuschlagskriterium!"]
[]
[]
["Text Eingabe Kuvert1 (TEK)"]
[]
["Die Angebote sind vollständig ausgefüllt im verschlossenen Umschlag mit der Aufschrift:"]
["Die Angebote sind vollständig ausgefüllt in zwei verschlossenen, getrennten Kuverts, jeweils versehen mit der Aufschrift:"]
[]
[]
[]
[]
["Vergabestelle (VS)"]
[]
["KFöB"]
["Departement"]
["Leitung Bedarfsstelle"]
[]
[]
["Offertöffnung (OF)"]
[" "]
["Kuvert 1: Technisches Angebot"]
["Kuvert 2: Finanzielles Angebot"]
[" "]
[]
[]
["Teilsystem (TS)"]
[]
["TBA-Umgestaltung"]
["TBA-Erhaltung"]
["TBA-Velorahmenkredit"]
["TBA-Fussverkehrrahmenkredit"]
["TBA-Kanalisation"]
["TBA-Kunstbauten"]
["IWB"]
["IWB-E"]
["IWB-G/W"]
["IWB-FW"]
["Swisscom"]
["Telekom"]
["Stadtgärtnerei"]
["BVB"]
["Gde. Riehen"]
["Gde. Bettingen"]
[]
[]
["Budget (BU)"]
[]
["6170."]
["laufende Rechnung"]

{"sheet":"Tabelle2","index":2,"n_rows":0,"n_cols":0,"rows_kept":0,"cut":false,"hidden":true,"merged":[]}